{"text_format":"1","workbook":"xlsx","n_sheets":2,"sheets":["Instructions","Interface"],"not_rendered":{"charts":0,"images":1,"macros":1,"external_links":0,"defined_names":0,"comments":0,"pivot_tables":0},"unopened":[],"bounds":{"document_bytes":16777216,"sheet_cells":100000,"rows_first":2000,"rows_last":500,"rows_between":2000,"halvings":0,"cell_chars":16384,"cell_head_chars":4096},"cells_cut":0,"cells_raw":0,"read":"whole","date_system":"1900"}

{"sheet":"Instructions","index":0,"n_rows":14,"n_cols":1,"rows_kept":14,"cut":false,"hidden":false,"merged":[[0,0,2,7],[3,0,5,10],[6,0,8,10],[9,0,12,10],[13,0,17,10]]}
["Counting Fish"]
[]
[]
["The problem: How can we get a good idea of how many fish there are in a lake without doing something drastic and expensive like catching them all or draining the lake?"]
[]
[]
["The solution: Use the fact that relative frequency is a good estimate for probability,\nand that probability is a good estimate for relative frequency.  "]
[]
[]
["By catching and tagging a known number of fish, then releasing them back into the lake, although we don't know the total number, every time we take a sample of fish from the lake, we can use the proportions of tagged and untagged fish to estimate the total population.  "]
[]
[]
[]
["You have been assigned to calculate an estimate, but you must do this as efficiently as possible.  You will pay for every fish you catch or tag, but the more accurate your final estimate, the more you will earn at the end.  \nBased on the size of the habitat, experts predict somewhere between 1000 and 10,000 fish.  "]

{"sheet":"Interface","index":1,"n_rows":10057,"n_cols":10,"rows_kept":10057,"cut":false,"hidden":false,"merged":[[31,6,31,8],[0,0,2,7],[7,0,7,3],[25,1,27,10],[10,0,11,8],[14,1,16,10],[8,6,9,7],[8,2,9,2],[18,2,19,2],[18,6,19,7],[17,0,17,4],[7,5,7,9],[37,1,38,2],[37,5,38,7],[17,5,17,9],[21,0,22,8],[35,1,36,10],[31,1,31,3],[32,4,33,4],[37,3,38,4],[37,8,38,9],[29,4,30,4],[29,1,30,3],[29,6,30,8],[29,9,30,9],[32,1,33,3],[32,6,33,8],[32,9,33,9]]}
["Counting Fish"]
[]
[]
[]
["Step 1:"]
[null,"Take an initial sample from the lake, tag them, and return them.  "]
[]
["Choose how many fish to tag:",null,null,null,null,{"$f":"\"Cost to catch and tag \"&C9&\" fish: \"","v":"Cost to catch and tag 10 fish: "}]
[null,null,10,null,null,null,{"$f":"5*C9","v":50}]
[]
["When you have decided on the size of the sample to be tagged, click Next:"]
[]
[]
["Step 2:"]
[null,"After allowing time for the tagged fish to mix with the rest of the population,\ncatch a second sample and find the relative frequency of tagged fish.  "]
[]
[]
["Choose how many fish to catch:",null,null,null,null,{"$f":"\"Cost to catch and check \"&C19&\" fish: \"","v":"Cost to catch and check 10 fish: "}]
[null,null,10,null,null,null,{"$f":"2*C19","v":20}]
[]
[]
["When you have decided on the number for your second sample, click Next:"]
[]
[]
["Step 3:"]
[null,"Use the relative frequency for your sample to estimate the relative frequency\nfor the whole population, and thus calculate an estimate for the overall total.  "]
[]
[]
[]
[null,"Your sample size:",null,null,{"$f":"D55","v":10},null,"Number of them tagged:",null,null,{"$f":"D57","v":0}]
[]
[null,{"$f":"G32","v":"None tagged!"},null,null,null,null,{"$f":"IF(ISERROR(\" x \"&ROUND(J33/J30,3)&\"...\"),\"None tagged!\",\" x \"&ROUND(J33/J30,3)&\"...\")","v":"None tagged!"}]
[null,"Population (estimate):",null,null,{"$f":"IF(ISERROR(ROUND(D54*D55/D57,0)),\"- - -\",ROUND(D54*D55/D57,0))","v":"- - -"},null,"Number of them tagged:",null,null,{"$f":"D54","v":10}]
[]
[]
[null,{"$f":"IF(ISERROR(\"You spent: \"&TEXT(D51+D52,\"£0\")&\". Your estimate of \"&E33&\" was within \"&E56&\"% of the true total, \"&D53&\".\"),\"None of the fish you caught were tagged!  You'll need bigger samples.\",\"You spent: \"&TEXT(D51+D52,\"£0\")&\". Your estimate of \"&E33&\" was within \"&E56&\"% of the true total, \"&D53&\".\")","v":"None of the fish you caught were tagged!  You'll need bigger samples."}]
[]
[null,{"$f":"IF(ISERROR(\"You are \"&IF(E58<0,\"fined\",\"paid\")&\":\"),\"You are fined: \",\"You are \"&IF(E58<0,\"fined\",\"paid\")&\":\")","v":"You are fined: "},null,{"$f":"IF(ISERROR(ABS(E58)),5000,ABS(E58))","v":5000},null,{"$f":"IF(ISERROR(\"Making a \"&IF(E58<E36,\"loss\",\"profit\")&\" of:\"),\"Making a loss of:\",\"Making a \"&IF(E58<E36,\"loss\",\"profit\")&\" of:\")","v":"Making a loss of:"},null,null,{"$f":"IF(ISERROR(ABS(E58-(D51+D52))),D51+D52+5000,ABS(E58-(D51+D52)))","v":5070}]
[]
[]
[]
[]
[]
[]
[]
[]
[]
[]
[]
[null,null,"rand","fixed"]
[null,"Spent1",{"$f":"G9","v":50},50]
[null,"Spent2",{"$f":"G19","v":20},20]
[null,"Population",{"$f":"RANDBETWEEN(1000,10000)","v":1537},2693]
[null,"Tagged",{"$f":"C9","v":10},10]
[null,"Checked",{"$f":"C19","v":10},10,{"$f":"ROUND(D54*D55/D57,0)","v":{"$error":"#DIV/0!"}}]
[null,"% away",{"$f":"D54/D53","v":3.7133308577794281E-3},{"$f":"D57/D55","v":0},{"$f":"INT(ABS(1-E55/D53)*100)","v":{"$error":"#DIV/0!"}}]
[null,"Check-tagged",{"$f":"LOOKUP(D55,B58:B10057,D58:D10057)","v":0},0,{"$f":"E56^1.4","v":{"$error":"#DIV/0!"}}]
[null,1,{"$f":"IF(RAND()<$C$56,1,0)","v":0},{"$f":"C58","v":0},{"$f":"10000-20*E57","v":{"$error":"#DIV/0!"}}]
[null,2,{"$f":"IF(RAND()<$C$56,1,0)","v":0},{"$f":"C59+D58","v":0}]
[null,3,0,{"$f":"C60+D59","v":0}]
[null,4,0,0]
[null,5,0,0]
[null,6,0,0]
[null,7,0,0]
[null,8,0,0]
[null,9,0,0]
[null,10,0,0]
[null,11,0,0]
[null,12,0,0]
[null,13,0,0]
[null,14,0,0]
[null,15,0,0]
[null,16,0,0]
[null,17,0,0]
[null,18,0,0]
[null,19,0,0]
[null,20,0,0]
[null,21,0,0]
[null,22,0,0]
[null,23,0,0]
[null,24,0,0]
[null,25,0,0]
[null,26,0,0]
[null,27,0,0]
[null,28,0,0]
[null,29,0,0]
[null,30,0,0]
[null,31,0,0]
[null,32,0,0]
[null,33,0,0]
[null,34,0,0]
[null,35,0,0]
[null,36,0,0]
[null,37,0,0]
[null,38,0,0]
[null,39,0,0]
[null,40,0,0]
[null,41,0,0]
[null,42,0,0]
[null,43,0,0]
[null,44,0,0]
[null,45,0,0]
[null,46,0,0]
[null,47,0,0]
[null,48,0,0]
[null,49,0,0]
[null,50,0,0]
[null,51,0,0]
[null,52,0,0]
[null,53,0,0]
[null,54,0,0]
[null,55,0,0]
[null,56,0,0]
[null,57,0,0]
[null,58,0,0]
[null,59,0,0]
[null,60,0,0]
[null,61,0,0]
[null,62,0,0]
[null,63,0,0]
[null,64,0,0]
[null,65,0,0]
[null,66,{"$f":"IF(RAND()<$C$56,1,0)","v":0},0]
[null,67,0,{"$f":"C124+D123","v":0}]
[null,68,0,0]
[null,69,0,0]
[null,70,0,0]
[null,71,0,0]
[null,72,0,0]
[null,73,0,0]
[null,74,0,0]
[null,75,0,0]
[null,76,0,0]
[null,77,0,0]
[null,78,0,0]
[null,79,0,0]
[null,80,0,0]
[null,81,0,0]
[null,82,0,0]
[null,83,0,0]
[null,84,0,0]
[null,85,0,0]
[null,86,0,0]
[null,87,0,0]
[null,88,0,0]
[null,89,0,0]
[null,90,0,0]
[null,91,0,0]
[null,92,0,0]
[null,93,0,0]
[null,94,0,0]
[null,95,0,0]
[null,96,0,0]
[null,97,0,0]
[null,98,0,0]
[null,99,0,0]
[null,100,0,0]
[null,101,0,0]
[null,102,0,0]
[null,103,0,0]
[null,104,0,0]
[null,105,0,0]
[null,106,0,0]
[null,107,0,0]
[null,108,0,0]
[null,109,0,0]
[null,110,0,0]
[null,111,0,0]
[null,112,0,0]
[null,113,0,0]
[null,114,0,0]
[null,115,1,1]
[null,116,0,1]
[null,117,0,1]
[null,118,0,1]
[null,119,0,1]
[null,120,0,1]
[null,121,0,1]
[null,122,0,1]
[null,123,0,1]
[null,124,0,1]
[null,125,0,1]
[null,126,0,1]
[null,127,0,1]
[null,128,0,1]
[null,129,0,1]
[null,130,{"$f":"IF(RAND()<$C$56,1,0)","v":0},1]
[null,131,0,{"$f":"C188+D187","v":1}]
[null,132,0,1]
[null,133,0,1]
[null,134,0,1]
[null,135,0,1]
[null,136,0,1]
[null,137,0,1]
[null,138,0,1]
[null,139,0,1]
[null,140,0,1]
[null,141,1,2]
[null,142,0,2]
[null,143,0,2]
[null,144,0,2]
[null,145,0,2]
[null,146,0,2]
[null,147,0,2]
[null,148,0,2]
[null,149,0,2]
[null,150,0,2]
[null,151,0,2]
[null,152,0,2]
[null,153,0,2]
[null,154,0,2]
[null,155,0,2]
[null,156,0,2]
[null,157,0,2]
[null,158,0,2]
[null,159,0,2]
[null,160,0,2]
[null,161,0,2]
[null,162,0,2]
[null,163,0,2]
[null,164,0,2]
[null,165,0,2]
[null,166,0,2]
[null,167,0,2]
[null,168,0,2]
[null,169,0,2]
[null,170,0,2]
[null,171,0,2]
[null,172,0,2]
[null,173,0,2]
[null,174,0,2]
[null,175,0,2]
[null,176,0,2]
[null,177,0,2]
[null,178,0,2]
[null,179,0,2]
[null,180,0,2]
[null,181,0,2]
[null,182,0,2]
[null,183,0,2]
[null,184,0,2]
[null,185,0,2]
[null,186,0,2]
[null,187,0,2]
[null,188,0,2]
[null,189,0,2]
[null,190,0,2]
[null,191,0,2]
[null,192,0,2]
[null,193,0,2]
[null,194,{"$f":"IF(RAND()<$C$56,1,0)","v":0},2]
[null,195,0,{"$f":"C252+D251","v":2}]
[null,196,0,2]
[null,197,0,2]
[null,198,0,2]
[null,199,0,2]
[null,200,0,2]
[null,201,0,2]
[null,202,0,2]
[null,203,0,2]
[null,204,0,2]
[null,205,0,2]
[null,206,0,2]
[null,207,0,2]
[null,208,0,2]
[null,209,0,2]
[null,210,0,2]
[null,211,0,2]
[null,212,0,2]
[null,213,0,2]
[null,214,0,2]
[null,215,0,2]
[null,216,0,2]
[null,217,0,2]
[null,218,0,2]
[null,219,0,2]
[null,220,0,2]
[null,221,0,2]
[null,222,0,2]
[null,223,0,2]
[null,224,0,2]
[null,225,0,2]
[null,226,0,2]
[null,227,0,2]
[null,228,0,2]
[null,229,0,2]
[null,230,0,2]
[null,231,0,2]
[null,232,0,2]
[null,233,0,2]
[null,234,0,2]
[null,235,0,2]
[null,236,0,2]
[null,237,0,2]
[null,238,0,2]
[null,239,0,2]
[null,240,0,2]
[null,241,0,2]
[null,242,0,2]
[null,243,0,2]
[null,244,0,2]
[null,245,0,2]
[null,246,0,2]
[null,247,0,2]
[null,248,0,2]
[null,249,0,2]
[null,250,0,2]
[null,251,0,2]
[null,252,0,2]
[null,253,0,2]
[null,254,0,2]
[null,255,0,2]
[null,256,0,2]
[null,257,0,2]
[null,258,{"$f":"IF(RAND()<$C$56,1,0)","v":0},2]
[null,259,0,{"$f":"C316+D315","v":2}]
[null,260,0,2]
[null,261,0,2]
[null,262,0,2]
[null,263,0,2]
[null,264,0,2]
[null,265,0,2]
[null,266,0,2]
[null,267,0,2]
[null,268,0,2]
[null,269,0,2]
[null,270,0,2]
[null,271,0,2]
[null,272,0,2]
[null,273,0,2]
[null,274,0,2]
[null,275,0,2]
[null,276,0,2]
[null,277,0,2]
[null,278,0,2]
[null,279,0,2]
[null,280,0,2]
[null,281,0,2]
[null,282,0,2]
[null,283,0,2]
[null,284,0,2]
[null,285,0,2]
[null,286,0,2]
[null,287,0,2]
[null,288,0,2]
[null,289,0,2]
[null,290,0,2]
[null,291,0,2]
[null,292,0,2]
[null,293,0,2]
[null,294,0,2]
[null,295,0,2]
[null,296,0,2]
[null,297,0,2]
[null,298,0,2]
[null,299,0,2]
[null,300,0,2]
[null,301,0,2]
[null,302,0,2]
[null,303,0,2]
[null,304,0,2]
[null,305,0,2]
[null,306,0,2]
[null,307,0,2]
[null,308,0,2]
[null,309,0,2]
[null,310,0,2]
[null,311,0,2]
[null,312,0,2]
[null,313,0,2]
[null,314,0,2]
[null,315,0,2]
[null,316,0,2]
[null,317,0,2]
[null,318,0,2]
[null,319,0,2]
[null,320,0,2]
[null,321,0,2]
[null,322,{"$f":"IF(RAND()<$C$56,1,0)","v":0},2]
[null,323,0,{"$f":"C380+D379","v":2}]
[null,324,0,2]
[null,325,0,2]
[null,326,0,2]
[null,327,0,2]
[null,328,0,2]
[null,329,0,2]
[null,330,0,2]
[null,331,0,2]
[null,332,0,2]
[null,333,0,2]
[null,334,0,2]
[null,335,0,2]
[null,336,0,2]
[null,337,0,2]
[null,338,0,2]
[null,339,0,2]
[null,340,0,2]
[null,341,0,2]
[null,342,0,2]
[null,343,0,2]
{"$rows_left_out":9657}